religiones-ANULADO
type: Concept
preferred label: religião-INATIVO @pt-br
preferred label: Religioni - ANNULLATO @it
preferred label: religion-DEPRECATED @en-gb
preferred label: Religion-GELÖSCHT @de
preferred label: Religion-DEPRECATED @fr
preferred label: 宗教団体-使用不可 @ja-jp
definition: 確定した信仰制度を備えた確立した神学 @ja-jp
definition: INATIVO-Teologias estabelecidas com sistemas de crenças fixos. @pt-pt
definition: ANULADO
definition: Insieme delle credenze, dogmi, pratiche cultuali alla base del rapporto dell'uomo con la rivelazione divina @it
definition: NA @en-gb
definition: Ensemble des croyances, des dogmes et des pratiques cultuelles régissant les rapports de l'homme avec la puissance divine ou les puissances surnaturelles @fr
definition: --- @de
note: Hier gelöscht, Unterbegriffe zu anderen Hauptbegriffen verschoben @de
note: SubjectMatter deprecated, SubjectDetails moved to other SubjectMatter
note: SubjectMatter ANNULLATO, SubjectDetails spostato ad altro SubjectMatter @it
in scheme: subjectcode
created: 2003-04-05T12:00:00+00:00
retired: 2004-08-27T00:00:00+00:00
modified: 2012-07-10T12:00:00+00:00
broader: http://cv.iptc.org/newscodes/subjectcode/12000000
narrower: http://cv.iptc.org/newscodes/subjectcode/12004001
narrower: http://cv.iptc.org/newscodes/subjectcode/12004002
narrower: http://cv.iptc.org/newscodes/subjectcode/12004003
narrower: http://cv.iptc.org/newscodes/subjectcode/12004004
narrower: http://cv.iptc.org/newscodes/subjectcode/12004005