islão-INATIVO
type: Concept
preferred label: Islamica - ANNULLATO @it
preferred label: Islam-GELÖSCHT @de
preferred label: islam-DEPRECATED @en-gb
preferred label: islam-ANULADO @es
preferred label: islã-INATIVO
preferred label: Musulman-DEPRECATED @fr
preferred label: イスラム教-使用不可 @ja-jp
definition: INATIVO-Aqueles que usam Alá e os seus ensinamentos como centro da sua crença religiosa.
definition: アラーとその教えを信仰の中心とする人たち @ja-jp
definition: La religione fondata dal profeta Maometto @it
definition: --- @de
definition: NA @en-gb
definition: INATIVO-Aqueles que usam Alá e seus ensinamentos como centro de sua crença religiosa.
definition: Disciple de la religion fondée par le prophète arabe Mahomet @fr
definition: ANULADO @es
note: verschoben zu 12010000 @de
note: spostato in 12010000 @it
note: moved to 12010000 @en-gb
in scheme: subjectcode
created: 2003-04-05T12:00:00+00:00
retired: 2004-08-27T00:00:00+00:00
modified: 2012-07-10T12:00:00+00:00
broader: http://cv.iptc.org/newscodes/subjectcode/12004000