Judentum-GELÖSCHT
type: Concept
preferred label: judaísmo-INATIVO @pt-pt
preferred label: ユダヤ教-使用不可 @ja-jp
preferred label: judaísmo-ANULADO @es
preferred label: Ebraica - ANNULLATO @it
preferred label: judaism-DEPRECATED @en-gb
preferred label: Judaïsme-DEPRECATED @fr
definition: ANULADO @es
definition: 経典やタルムードに書かれた、メシヤの処女降誕を含む信念に基づいて、唯一神を信じているグループ @ja-jp
definition: Religion des juifs et première des grandes religions monothéistes qui a pour fondement l'Alliance inaugurée par Dieu avec le prophète Abraham et la Loi (Torah) donnée à Moïse. @fr
definition: INATIVO-Grupo que acredita em um só deus, baseando as suas crenças nas escrituras e no Talmude, incluindo a primeira vinda do Messias. @pt-pt
definition: ---
definition: INATIVO-Grupo que acredita em um só deus, baseando suas crenças nas escrituras e no Talmude, incluindo a primeira vinda do Messias. @pt-br
definition: NA @en-gb
definition: La prima delle grandi religioni monoteiste, che si fonda nell'alleanza voluta da Dio con il profeta Abramo e nella Torah @it
note: spostato in 12011000 @it
note: Verschoben unter 12011000
note: moved to 12011000 @en-gb
in scheme: subjectcode
created: 2003-04-05T12:00:00+00:00
retired: 2004-08-27T00:00:00+00:00
modified: 2012-07-10T12:00:00+00:00
broader: http://cv.iptc.org/newscodes/subjectcode/12004000