buddhism-DEPRECATED
type: Concept
preferred label: Boudhisme-DEPRECATED @fr
preferred label: budismo-INATIVO @pt-br
preferred label: Buddhismus-GELÖSCHT @de
preferred label: 仏教-使用不可 @ja-jp
preferred label: Buddista - ANNULLATO @it
preferred label: budismo-ANULADO @es
definition: ANULADO @es
definition: インドで紀元前6世紀に仏陀によって設立された主要なアジアの宗教で、正しい思考と自制は、欲望のない神の状態へと導くであろうことを説いている @ja-jp
definition: INATIVO-Importante religião asiática fundada por Buda no séc. VI, na Índia, que prega que o bom uso da razão e a abnegação conduzem a um estado divino sem desejo. @pt-pt
definition: Religione originaria dell'India predicata da Buddah @it
definition: --- @de
definition: NA
definition: Religion originaire de l'Inde prêchée au 6ème siècle par le Bouddha selon laquelle le sage doit anéantir en lui le désir pour atteindre le nirvana. @fr
note: moved to 12012000
note: Verschoben unter 12012000 @de
note: spostato in 12012000 @it
in scheme: subjectcode
created: 2003-04-05T12:00:00+00:00
retired: 2004-08-27T00:00:00+00:00
modified: 2012-07-10T12:00:00+00:00
broader: http://cv.iptc.org/newscodes/subjectcode/12004000