hinduísmo-INATIVO
type: Concept
preferred label: Hindouisme-DEPRECATED @fr
preferred label: hinduism-DEPRECATED @en-gb
preferred label: Hinduismus-GELÖSCHT @de
preferred label: hinduismo-ANULADO @es
preferred label: ヒンズー教-使用不可 @ja-jp
preferred label: Induista - ANNULLATO @it
definition: --- @de
definition: NA @en-gb
definition: ANULADO @es
definition: 宗教的、社会的な制度で、バラモンの地位が最も高く、不可触民の地位が最も低いとするカースト制度を信じる @ja-jp
definition: Insieme dei principi religiosi basati sostanzialmente su un'organizzazione sociale divisa in caste @it
definition: INATIVO-Sistema religioso e social que acredita numa organização da sociedade por castas, dos brâmanes (a casta mais alta) aos intocáveis (a casta mais baixa).
definition: INATIVO-Sistema religioso e social que acredita em uma organização da sociedade por castas, dos brâmanes (a casta mais alta) aos intocáveis (a casta mais baixa).
definition: Ensemble de courants religieux reposant notamment sur une organisation sociale en système de castes, des intouchables (la plus basse) aux Brahmans (la plus haute) @fr
note: moved to 12013000 @en-gb
note: Verschoben unter 12013000 @de
note: spostato in 12013000 @it
in scheme: subjectcode
created: 2003-04-05T12:00:00+00:00
retired: 2004-08-27T00:00:00+00:00
modified: 2012-07-10T12:00:00+00:00
broader: http://cv.iptc.org/newscodes/subjectcode/12004000