Kirche-GELÖSCHT
type: Concept
preferred label: igreja (organização)-INATIVO @pt-br
preferred label: église-DEPRECATED @fr
preferred label: Chiese - ANNULLATO @it
preferred label: 教会(組織)-使用不可 @ja-jp
preferred label: inglesia (organización) cancelado @es
preferred label: church (organisation)-DEPRECATED @en-gb
definition: NA @en-gb
definition: ANULADO @es
definition: Edifici consacrati al culto divino per i cristiani @it
definition: Edifice consacré au culte divin pour les chrétiens @fr
definition: ---
definition: INATIVO-Edifício geralmente identificado como lugar de culto da religião cristã. @pt-pt
definition: 概してキリスト教を崇拝する場所として同一視できる建物 @ja-jp
note: moved to 12000001/SubjectQualifier @es
note: SubjectMatter deprecated, SubjectDetails moved to other SubjectMatter @fr
note: spostato in 12000001 SubjectQualifier @it
note: Verschoben als 12000001/SubjectQualifier
in scheme: subjectcode
created: 2000-10-30T12:00:00+00:00
retired: 2004-08-27T00:00:00+00:00
modified: 2010-12-15T17:01:09+00:00
broader: http://cv.iptc.org/newscodes/subjectcode/12000000
narrower: http://cv.iptc.org/newscodes/subjectcode/12005001