Principi morali
type: Concept
preferred label: valores @pt-pt
preferred label: Valeurs @fr
preferred label: values @en-gb
preferred label: 価値観 @ja-jp
preferred label: Wertvorstellung @de
definition: Níveis pessoais de conduta social. @pt-pt
definition: Niveles personales de conducta social. @es
definition: Persönliche Stufen sozialen Verhaltens. @de
definition: 社会行動の個人的なレベル @ja-jp
definition: Principes, idéaux de référence, qui guident une conduite @fr
definition: Principi, ideali di riferimento, convinzioni che guidano l'esistenza dell'individuo
definition: Personal levels of social behaviour @en-gb
note: moved to 12010000 @fr
note: nessuno
in scheme: subjectcode
created: 2000-10-30T12:00:00+00:00
modified: 2010-12-15T17:01:09+00:00
broader: http://cv.iptc.org/newscodes/subjectcode/12000000
narrower: http://cv.iptc.org/newscodes/subjectcode/12006001
narrower: http://cv.iptc.org/newscodes/subjectcode/12006002