Etica
type: Concept
preferred label: ética @es
preferred label: 倫理 @ja-jp
preferred label: ethics @en-gb
preferred label: Ethik @de
preferred label: éthique @fr
definition: Filosofia del comportamento secondo morale
definition: Sistema de crenças acerca de uma conduta aceitável. @pt-br
definition: Glaubenssystem aus akzeptablem Verhalten. @de
definition: 好ましい行動についての信念の体系 @ja-jp
definition: Sistema de creencias acerca de una conducta aceptable. @es
definition: A system of beliefs about acceptable behaviour @en-gb
definition: Science des mœurs et de la morale @fr
note: nessuno
note: moved to 12011000 @fr
in scheme: subjectcode
created: 2003-04-05T12:00:00+00:00
modified: 2012-07-10T12:00:00+00:00
broader: http://cv.iptc.org/newscodes/subjectcode/12006000