Corruption
type: Concept
preferred label: 悪行 @ja-jp
preferred label: Comportamenti Immorali @it
preferred label: prácticas corruptas @es
preferred label: Korruptes Verhalten @de
preferred label: corrupção religiosa @pt-br
preferred label: corrupt practices @en-gb
definition: Comportamenti corrotti, contrari a principi morali e atti danneggiare qualcuno @it
definition: Cualquier acción que sea dañina para otros. @es
definition: Toda ação que seja nociva para os outros. @pt-br
definition: Qualquer ação que seja nociva para os outros. @pt-pt
definition: Moyens employés pour circonvenir quelqu'un
definition: Any action which is harmful to others @en-gb
definition: 他人に有害な行動 @ja-jp
definition: Jedes Verhalten, was anderen schadet. @de
note: nessuno @it
note: moved to 12012000
in scheme: subjectcode
created: 2003-04-05T12:00:00+00:00
modified: 2012-07-10T12:00:00+00:00
broader: http://cv.iptc.org/newscodes/subjectcode/12006000