Rapporti Stato/Chiesa
type: Concept
preferred label: Beziehung Kirche und Staat @de
preferred label: estado e igreja (relação) @pt-br
preferred label: 政教分離 @ja-jp
preferred label: división entre religión y estado @es
preferred label: church and state relations @en-gb
preferred label: Relations entre l'église et l'Etat @fr
definition: Trennung von Kirche und Staat. @de
definition: Divisão legal e social entre instituições religiosas e assuntos de estado. @pt-br
definition: División social y legal entre instituciones religiosas y asuntos de estado. @es
definition: 宗教団体と国家との間の法律上や社会的な区分 @ja-jp
definition: Les lois régissant les rapports entre les institutions religieuses et l'état @fr
definition: Norme che regolano i rapporti fra lo Stato e la Chiesa e fra le istituzioni laiche dello stato e quelle religiose
definition: The legal and social division between religious institutions and the affairs of state @en-gb
note: moved to 12013000 @fr
note: nessuno
in scheme: subjectcode
created: 2003-04-05T12:00:00+00:00
modified: 2012-07-10T12:00:00+00:00
broader: http://cv.iptc.org/newscodes/subjectcode/12000000