Anglicana
type: Concept
preferred label: anglicano @pt-pt
preferred label: anglican @en-gb
preferred label: Anglikaner @de
preferred label: Anglicanisme @fr
preferred label: 英国国教会（聖公会） @ja-jp
definition: Mitglieder der weltweiten anglikanischen Gemeinschaft, entstanden im 16. Jahrhundert in England nach dem Bruch mit der römisch-katholischen Kirche. @de
definition: Communauté chrétienne qui trouve son origine en Angleterre au 16e siècle comme scission de l'Eglise catholique romaine @fr
definition: Members of the worldwide anglican communion which started in the 16th century in England as a breakaway church from the roman catholic church @en-gb
definition: Miembros de la comunión mundial Anglicana que comenzó en el siglo 16 en Inglaterra dividiendose de la inglesia Católica Romana. @es
definition: Membros da comunhão anglicana mundial, que nasceu no séc. XVI na Inglaterra, em resultado da cisão com a igreja católica romana. @pt-br
definition: ローマカトリック教会から離脱し、16世紀の英国で始まった、世界的なアングリカン･コミュニオン(聖公会組織)のメンバー @ja-jp
definition: Chiesa nata dallo scisma in Inghilterra nel XVI secolo, sotto il regno di Enrico VIII, dalla chiesa cattolica
note: nessuno
in scheme: subjectcode
created: 2004-08-27T12:00:00+00:00
modified: 2012-07-10T12:00:00+00:00
broader: http://cv.iptc.org/newscodes/subjectcode/12009000