Metodista
type: Concept
preferred label: メソジスト派 @ja-jp
preferred label: Methodisten @de
preferred label: metodista @pt-br
preferred label: methodist @en-gb
preferred label: Méthodisme @fr
definition: Anhänger von John und Charles Wesley, die im 18. Jahrhundert die Kirche von England reformieren wollten und dadurch eine eigene Kirche gründeten. @de
definition: Followers of John and Charles Wesley who tried to reform the Church of England in the 18th century and turned into a separate church @en-gb
definition: Seguidores de John y Charles quienes trataron de reformar la inglesia en Ingaterra en el siglo 18 y que originó en una iglesia aparte. @es
definition: 18世紀に英国国教会を改革しようとし、別の教会に分離したジョン･ウェスレーとチャールズ･ウェスレーの追随者達 @ja-jp
definition: Movimento fondato da John e Charles Wesley che nel XVIII secolo provarono a riformare la chiesa d'Inghilterra e diedero vita ad una chiesa separata
definition: Partisans de John et Charles Wesley qui ont essayé de réformer l'Eglise d'Angleterre au 18e siècle @fr
definition: Seguidores de John e Charles Wesley, irmãos que tentaram reformar a igreja de Inglaterra no séc. XVIII e que formaram uma igreja separada. @pt-pt
note: nessuno
in scheme: subjectcode
created: 2004-08-27T12:00:00+00:00
modified: 2012-07-10T12:00:00+00:00
broader: http://cv.iptc.org/newscodes/subjectcode/12009000