ortodoxia
type: Concept
preferred label: 東方正教 @ja-jp
preferred label: ortodoxo @es
preferred label: Ortodossa @it
preferred label: Orthodoxie @fr
preferred label: orthodoxy @en-gb
preferred label: Orthodoxe @de
definition: Kirchen des byzantinischen Ritus, die in der apostolischen Tradition stehen, vor allem in Ost- und Südosteuropa sowie im Mittleren Osten. @de
definition: Iglesias Cristiamas que se caracterizan por su continuidad de los ritos de la inglesia apostólica, sus liturgias y sus iglesias territoriales, principalmente en el este y sudeste de Europa y el Medio Oriente. @es
definition: Igrejas cristãs que se caracterizam pela continuidade dos rituais da igreja apostólica, pela liturgia e pelas igrejas territoriais, sobretudo no sudeste da Europa e no Médio Oriente.
definition: Igrejas cristãs que se caracterizam pela continuidade dos rituais da igreja apostólica, pela liturgia e pelas igrejas territoriais, sobretudo no sudeste da Europa e no Oriente Médio.
definition: Chiesa d'Oriente che accoglie tutti i credenti che hanno accettato i principi stabiliti nei Concili di Nicea, Efeso e Calcedonia @it
definition: Rite chrétien orthodoxe caractérisée par la continuité de l'église apostolique, principalement à l'Est de l'Europe et au Moyen Orient @fr
definition: 主に中東及び東･南東ヨーロッパにおいて、十二使徒教会や聖体礼儀や管轄区教会と密接な関連があると特徴づけられる東方正教会 @ja-jp
definition: Eastern rite churches which are characterised by their continuity with the apostolic church, their liturgy and their territorial churches, mainly in eastern and south-eastern Europe and the Middle East @en-gb
note: nessuno @it
in scheme: subjectcode
created: 2004-08-27T12:00:00+00:00
modified: 2012-07-10T12:00:00+00:00
broader: http://cv.iptc.org/newscodes/subjectcode/12009000