Esercito Salvezza
type: Concept
preferred label: Heilsarmee @de
preferred label: 救世軍 @ja-jp
preferred label: Armée du Salut @fr
preferred label: salvation army @en-gb
preferred label: exército de salvação @pt-pt
preferred label: ejército de salvación @es
definition: Communauté chrétienne organisée de manière militaire et dédiée au travail social @fr
definition: 伝道と社会事業を目的として組織された軍隊式キリスト教団体 @ja-jp
definition: Christian community organised in a military fashion which does missionary and social work @en-gb
definition: Comunidade cristã organizada de forma militar e que faz trabalho missionário e social. @pt-pt
definition: Organización Cristiana organizada en forma militar que practica el evenagelio y realiza trabajos sociales. @es
definition: Comunità cristiana organizzata in maniera militare che si occupa di missioni e lavori sociali
definition: Militärisch organisierte christliche Gemeinschaft, die missionarisch und sozial tätig ist. @de
note: nessuno
in scheme: subjectcode
created: 2004-08-27T12:00:00+00:00
modified: 2012-07-10T12:00:00+00:00
broader: http://cv.iptc.org/newscodes/subjectcode/12009000
broad match: http://cv.iptc.org/newscodes/mediatopic/20000659