Festività religiose
type: Concept
preferred label: Religiöses Fest oder Feiertag @de
preferred label: festivales o festivades religiosas @es
preferred label: religious festival or holiday @en-gb
preferred label: festas e feriados religiosos @pt-pt
preferred label: 宗教祭・祭日 @ja-jp
preferred label: Fête religieuse @fr
definition: Giorno sacro o comunque di osservanza di un dato precetto che talvolta corrisponde anche ad un giorno festivo
definition: Holy day or day of observance in a religion which sometimes is a public holiday as well @en-gb
definition: Dia festivo ou dia de prática religiosa que por vezes também é um feriado público. @pt-br
definition: 時には公休日となる祝祭日、または宗教上の祝いの日 @ja-jp
definition: Jour de fête religieuse ou de rite particulier dans une religion, parfois un jour férié @fr
definition: Días festivo o dia de práctica religiosa el cual a veces es un día festivo público. @es
definition: Feiertag oder religiöser Anlass, der manchmal auch ein öffentlicher Feiertag ist. @de
note: nessuno
in scheme: subjectcode
created: 2004-08-27T12:00:00+00:00
modified: 2012-07-10T12:00:00+00:00
broader: http://cv.iptc.org/newscodes/subjectcode/12000000
narrower: http://cv.iptc.org/newscodes/subjectcode/12014001
narrower: http://cv.iptc.org/newscodes/subjectcode/12014002
narrower: http://cv.iptc.org/newscodes/subjectcode/12014003
narrower: http://cv.iptc.org/newscodes/subjectcode/12014004
narrower: http://cv.iptc.org/newscodes/subjectcode/12014005