Pasqua
type: Concept
preferred label: páscoa @pt-pt
preferred label: Ostern @de
preferred label: easter @en-gb
preferred label: 復活祭 @ja-jp
preferred label: Pâques @fr
preferred label: semana santa @es
definition: Festa cristiana in cui si celebra la resurrezione di Gesù Cristo
definition: Festividad Cristiana en conmemoración de la resurreción de Jesucristo. @es
definition: Festa cristã que comemora a ressurreição de Jesus Cristo. @pt-pt
definition: Christian festival in commemorating the resurrection of Jesus Christ @en-gb
definition: Fête chrétienne de commémoration de la résurrection de Jésus Christ @fr
definition: Fest zur Erinnerung an die Auferstehung von Jesus Christus. @de
definition: イエス･キリストの復活を記念するキリスト教徒の祭日 @ja-jp
note: nessuno
note: moved from 12004002 @fr
in scheme: subjectcode
created: 2004-08-27T12:00:00+00:00
modified: 2012-07-10T12:00:00+00:00
broader: http://cv.iptc.org/newscodes/subjectcode/12014000