Pentecoste
type: Concept
preferred label: pentecostes @pt-br
preferred label: Pentecôte @fr
preferred label: pentecost @en-gb
preferred label: Pfingsten @de
preferred label: 聖霊降臨祭 @ja-jp
preferred label: pentecostal @es
definition: 50 Tage nach Ostern begangenes Fest zur Erinnerung an die Herabkunft des Heiligen Geistes. @de
definition: Celebración Cristiana celebrada en el Quincuagésimo día despues de Semana Santa, que conmemora el descenso del Espíritu Santo. @es
definition: キリスト教徒の祝日。聖霊の降誕を記念して、復活祭の50日後に祝う @ja-jp
definition: Festa cristã, celebrada no 50.º dia depois da Páscoa, que comemora a descida do Espírito Santo. @pt-pt
definition: Christian festival, celebrated on the 50th day after Easter commemorating the descent of the Holy Spirit @en-gb
definition: Festa cristiana in cui si celebra la discesa dello Spirito Santo nel cinquantesimo giorno dopo la Pasqua
definition: Fête chrétienne, célébrée 50 jours après Pâques, commémorant le retour de l'Esprit saint @fr
note: moved from 12004003 @fr
note: nessuno
in scheme: subjectcode
created: 2004-08-27T12:00:00+00:00
modified: 2012-07-10T12:00:00+00:00
broader: http://cv.iptc.org/newscodes/subjectcode/12014000