ramadão
type: Concept
preferred label: Ramadan @de
preferred label: ramadã
preferred label: ramadan @es
preferred label: 断食月 @ja-jp
definition: Mês sagrado de jejum no Islão.
definition: Holy month of fasting in Islam @en-gb
definition: Mês sagrado de jejum no Islã.
definition: Mes Sagrado de ayuno en el Islamismo. @es
definition: Mois saint de jeûne pour l'Islam @fr
definition: イスラム教における、聖なる断食の月 @ja-jp
definition: Heiliger Fastenmonat des Islam. @de
definition: Mese sacro di digiuno nella religione islamica @it
note: moved from 12004004 @fr
note: nessuno @it
in scheme: subjectcode
created: 2004-08-27T12:00:00+00:00
modified: 2012-07-10T12:00:00+00:00
broader: http://cv.iptc.org/newscodes/subjectcode/12014000