Papa
type: Concept
preferred label: papa @pt-br
preferred label: ローマ法王 @ja-jp
preferred label: Papst @de
preferred label: Pape @fr
preferred label: pope @en-gb
definition: Chefe da igreja católica romana no mundo. @pt-pt
definition: Chef de l'Eglise romaine catholique @fr
definition: Cabeza de la Iglesia Católica Romana a nivel mundial. @es
definition: Capo della chiesa cattolica apostolica romana
definition: ローマカトリック教会の世界最高権威者 @ja-jp
definition: Weltweites Oberhaupt der römisch-katholischen Kirche. @de
definition: Head of the roman catholic church worldwide @en-gb
note: nessuno
in scheme: subjectcode
created: 2004-08-27T12:00:00+00:00
modified: 2012-07-10T12:00:00+00:00
broader: http://cv.iptc.org/newscodes/subjectcode/12015000