Taoismo
type: Concept
preferred label: taoismo @es
preferred label: Taoismus @de
preferred label: Taoïsme @fr
preferred label: 道教 @ja-jp
preferred label: taoism @en-gb
definition: Tradição indígena religiosa e filosófica que molda a cultura chinesa há mais de 2000 anos. @pt-br
definition: Tradição religiosa e filosófica que molda a cultura chinesa há mais de 2000 anos. @pt-pt
definition: Indigenous religio-philosophical tradition that has shaped Chinese life for more than 2000 years @en-gb
definition: 2000年以上に渡って中国人の生活を形成してきた、固有の宗教哲学的な伝統 @ja-jp
definition: Religion et tradition philosophique originaire de Chine voici plus de 2000 ans @fr
definition: Tradizione filosofico-religiosa originaria della Cina
definition: Tradición indigena reliosa/filosófica que ha formado la vida cultura de China por mas de 2000 años. @es
definition: Ursprüngliche chinesische religiöse und philosophische Tradition, die seit mehr als 2000 Jahren das chinesische Leben beeinflusst. @de
note: nessuno
in scheme: subjectcode
created: 2004-08-27T12:00:00+00:00
modified: 2012-07-10T12:00:00+00:00
broader: http://cv.iptc.org/newscodes/subjectcode/12000000