Scintoismo
type: Concept
preferred label: Schintoismus @de
preferred label: shintoismo @es
preferred label: shintoism @en-gb
preferred label: Shintoïsme @fr
preferred label: xintoísmo @pt-br
preferred label: 神道 @ja-jp
definition: *Crenças e práticas religiosas indígenas do Japão. A palavra **shinto** (xintó, caminho dos deuses) foi adotada para diferenciar as crenças indígenas japonesas do budismo.* @pt-br
definition: 日本固有の宗教的信仰や習慣。神道という単語は日本固有の信仰と仏教を区別するために使用されるようになった @ja-jp
definition: Creencia religiosa indigena practicada en Japón. La palabra Shinto fue adoptada en orden a diferenciar creencias indígenas japonesas del Budismo. @es
definition: Ursprünglicher religiöser praktizierter Glaube in Japan. Die Bezeichnung Shinto wurde eingeführt um den ursprünglichen japanischen Glauben vom Buddhismus zu trennen. @de
definition: Tradition et pratique religieuse autochtone du Japon @fr
definition: Tradizione e pratica religiosa originaria del Giappone.
definition: Indigenous religious beliefs and practices of Japan. The word Shinto came into use in order to distinguish indigenous Japanese beliefs from Buddhism. @en-gb
note: nessuno
in scheme: subjectcode
created: 2004-08-27T12:00:00+00:00
modified: 2012-07-10T12:00:00+00:00
broader: http://cv.iptc.org/newscodes/subjectcode/12000000