confucionismo
type: Concept
preferred label: Konfuzianismus @de
preferred label: confucianism @en-gb
preferred label: 儒教 @ja-jp
preferred label: Confucianesimo @it
preferred label: Confucianisme @fr
preferred label: confucismo. @es
definition: Doutrina de vida propagada por Confúcio no séc. VI-V A.C. e seguida pelo povo chinês por mais de 2000 anos. Sua influência se estendeu até a Coreia, Japão e Vietnã.
definition: Philosophie, éthique et politique basée sur les enseignements du sage chinois Confucius @fr
definition: Insegnamento di vita e filosofico, etico e politico derivato dal saggio cinese Confucio (VI-V secolo a.C.). @it
definition: 紀元前6-5世紀頃、孔子によって広められ、2000年以上に渡って中国人に受け継がれてきた生き方。その影響は朝鮮、日本およびベトナムにまで及んだ @ja-jp
definition: The way of life propagated by Confucius in the 6th-5th century BC and followed by the Chinese people for more than 2000 years. Its influence has extended to Korea, Japan, and Vietnam. @en-gb
definition: Der Weg des Lebens, der durch Konfuzius propagiert wurde im 6.-5. Jahrhundert vor Christus und den die chinesische Bevölkerung seit mehr als 2000 Jahren befolgt. Die Einflüsse haben sich ausgedehnt nach Korea, Japan und Vietnam. @de
definition: Doutrina de vida propagada por Confúcio no séc. VI-V A.C. e seguida pelo povo chinês há mais de 2000 anos. A sua influência estendeu-se até à Coreia, Japão e Vietname.
definition: La forma de vida propagada por Confucios en los siglos sexto y quinto AC, y seguida por el prueblo de China por más de 2000 años. Sus influencias se extendieron hasta Corea, Japón y Vietnam. @es
note: nessuno @it
in scheme: subjectcode
created: 2004-08-27T12:00:00+00:00
modified: 2012-07-10T12:00:00+00:00
broader: http://cv.iptc.org/newscodes/subjectcode/12000000