Testi Religiosi
type: Concept
preferred label: textos religiosos @pt-pt
preferred label: Textes religieux @fr
preferred label: religious text @en-gb
preferred label: 聖典 @ja-jp
preferred label: Religiöse Schrift @de
definition: 教会もしくは宗教にとって神聖あるいは重要な聖典 @ja-jp
definition: Escrituras Sagradas o importantes para una iglesia o religión @es
definition: Schriften die heilig oder wichtig für eine Kirche oder Religion sind. @de
definition: Testi sacri che sono fondamento o comunque importanti per una chiesa o religione
definition: Escrituras sagradas ou importantes para uma igreja ou religião. @pt-br
definition: Textes sacrés ou importants pour une religion @fr
definition: Scriptures holy or important for a church or religion @en-gb
note: nessuno
in scheme: subjectcode
created: 2004-08-27T12:00:00+00:00
modified: 2012-07-10T12:00:00+00:00
broader: http://cv.iptc.org/newscodes/subjectcode/12000000
narrower: http://cv.iptc.org/newscodes/subjectcode/12023001
narrower: http://cv.iptc.org/newscodes/subjectcode/12023002
narrower: http://cv.iptc.org/newscodes/subjectcode/12023003