Bibbia
type: Concept
preferred label: 聖書 @ja-jp
preferred label: bíblia @pt-br
preferred label: Bibel @de
preferred label: biblia @es
preferred label: Bible @fr
preferred label: bible @en-gb
definition: Le Sacre Scritture della fede cristiana, composte dal Vecchio e Nuovo Testamento
definition: Escrituras Sagradas del Cristianismo consistentes de el Antiguo y Nuevo Testamento. @es
definition: 新約と旧約から成るキリスト教の聖典 @ja-jp
definition: Sacred scriptures of Christianity consisting of the old and new testament @en-gb
definition: Escrituras sagradas do cristianismo que consistem no Novo e no Velho Testamento. @pt-pt
definition: Livre saint de la Chrétienté @fr
definition: Heilige Schrift des Christentums, bestehend aus dem Alten und dem Neuen Testament. @de
note: nessuno
in scheme: subjectcode
created: 2004-08-27T12:00:00+00:00
modified: 2012-07-10T12:00:00+00:00
broader: http://cv.iptc.org/newscodes/subjectcode/12023000