diálogo inter-religioso
type: Concept
preferred label: 宗教間の対話 @ja-jp
preferred label: interreligious dialogue @en-gb
preferred label: Dialogo interreligioso @it
preferred label: dialogo inter-religoso @es
preferred label: Dialogue interreligieux @fr
preferred label: Interreligiöser Dialog @de
definition: Beziehungen zwischen verschiedenen Religionen. @de
definition: Qualquer forma de comunicação entre religiões.
definition: Any form of communication between religions @en-gb
definition: Ogni forma di comunicazione tra le diverse religioni @it
definition: あらゆる形式の宗教間の対話 @ja-jp
definition: Toute forme de communication entre les religions @fr
definition: Toda forma de comunicação entre religiões.
definition: Cualquier forma de comunicación entre las religiones. @es
note: nessuno @it
in scheme: subjectcode
created: 2004-08-27T12:00:00+00:00
modified: 2012-07-10T12:00:00+00:00
broader: http://cv.iptc.org/newscodes/subjectcode/12000000