Evento religioso
type: Concept
preferred label: religious event @en-gb
preferred label: Religiöses Ereignis @de
preferred label: acontecimento religioso @pt-pt
preferred label: 宗教行事 @ja-jp
preferred label: Evénement religieux @fr
preferred label: evento religioso @es
definition: Avvenimento con caratteristiche di tipo religioso, ma non festivo
definition: News regarding a religious event but not a festival or holiday @en-gb
definition: Artikel, die sich auf ein religiöses Ereignis beziehen, aber keine Feste oder Feiertage. @de
definition: Informations concernant un événement religieux sans être un festival ou une fête religieuse @fr
definition: Noticias relacionadas a un evento religioso, pero no una festival o feriado. @es
definition: Notícias relativas a acontecimentos religiosos mas não a feriados ou festas religiosas. @pt-br
definition: 祝祭や休日ではない宗教的な行事に関するニュース @ja-jp
note: nessuno
in scheme: subjectcode
created: 2004-08-27T12:00:00+00:00
modified: 2012-07-10T12:00:00+00:00
broader: http://cv.iptc.org/newscodes/subjectcode/12000000
narrower: http://cv.iptc.org/newscodes/subjectcode/12025001
narrower: http://cv.iptc.org/newscodes/subjectcode/12025002
narrower: http://cv.iptc.org/newscodes/subjectcode/12025004