Ecumenismo
type: Concept
preferred label: ecumenismo @pt-br
preferred label: キリスト教統一主義運動 @ja-jp
preferred label: Ökumene @de
preferred label: ecumenism @en-gb
preferred label: Oecuménisme @fr
definition: Relation entre les églises chrétiennes @fr
definition: Relations between christian churches @en-gb
definition: Relación entre las inglesias Cristianas. @es
definition: Relações entre igrejas cristãs. @pt-pt
definition: Beziehungen zwischen christlichen Kirchen. @de
definition: Relazioni tra chiese cristiane
definition: キリスト教会間の関係 @ja-jp
note: nessuno
in scheme: subjectcode
created: 2004-08-27T12:00:00+00:00
modified: 2012-07-10T12:00:00+00:00
broader: http://cv.iptc.org/newscodes/subjectcode/12000000