ciências aplicadas
type: Concept
preferred label: applied science @en-gb
preferred label: ciencias aplicadas @es
preferred label: Angewandte Wissenschaft @de
preferred label: Sciences appliquées @fr
preferred label: Scienza applicata @it
preferred label: 応用科学 @ja-jp
definition: Artikel über in der Praxis angewandtes Wissen im Umfeld der medizinischen Wissenschaft, Agrarwissenschaft, heimische Wissenschaften genauso wie Handel und Handwerk. @de
definition: Histórias sobre a aplicação do conhecimento científico na solução de questões práticas.
definition: Artículos acerca de dar al conocimiento científico un uso práctico en los campos de la ciencia médica, la agricultura, las ciencias domésticas, además de las artes y oficios. @es
definition: La mise en pratique du savoir scientifique appliquée à la médecine, à l'agriculture, etc. @fr
definition: Stories about putting scientific knowledge to practical uses in the fields of the medical sciences, agriculture, domestic sciences as well as trades and crafts @en-gb
definition: 通商や工学だけでなく、医学、農業、家政学の分野で実用となる科学的な知識を応用することに関する記事 @ja-jp
definition: Applicazione della conoscenza scientifica per usi pratici in medicina, agricoltura, o altro ma anche in arti e mestieri @it
definition: Histórias sobre a aplicação do conhecimento científico a fins práticos nas áreas das ciências médicas, agricultura, ciências domésticas, bem como artes e ofícios.
note: nessuno @it
in scheme: subjectcode
created: 2000-10-30T12:00:00+00:00
modified: 2010-12-15T17:01:09+00:00
broader: http://cv.iptc.org/newscodes/subjectcode/13000000
narrower: http://cv.iptc.org/newscodes/subjectcode/13001001
narrower: http://cv.iptc.org/newscodes/subjectcode/13001002
narrower: http://cv.iptc.org/newscodes/subjectcode/13001003
narrower: http://cv.iptc.org/newscodes/subjectcode/13001004
broad match: http://cv.iptc.org/newscodes/mediatopic/13000000