Fisica
type: Concept
preferred label: física @es
preferred label: Physik @de
preferred label: 物理学 @ja-jp
preferred label: Physique @fr
preferred label: physics @en-gb
definition: Estudio de las propiedades y cambios de la materia. @es
definition: Studio delle proprietà e dei cambiamenti che subisce la materia
definition: Studium der Eigenschaften und Veränderungen von Materie. @de
definition: 物体の性質と変化についての学問 @ja-jp
definition: Estudo das propriedades e das mudanças da matéria. @pt-br
definition: The study of the properties and changes of matter @en-gb
definition: L'étude des propriétés de la matière et la détermination des lois qui la régissent @fr
note: nessuno
in scheme: subjectcode
created: 2003-04-05T12:00:00+00:00
modified: 2012-07-10T12:00:00+00:00
broader: http://cv.iptc.org/newscodes/subjectcode/13001000