Chimica
type: Concept
preferred label: química @pt-pt
preferred label: chemistry @en-gb
preferred label: Chimie @fr
preferred label: 化学 @ja-jp
preferred label: Chemie @de
definition: L'étude de la composition et des propriétés des corps, de leurs actions mutuelles et des transformations qu'ils peuvent subir @fr
definition: The study of the composition and reaction of substances @en-gb
definition: Studium der Zusammensetzung und Reaktion von Stoffen. @de
definition: 物質の合成や反応についての学問 @ja-jp
definition: Estudio de la composición y reacción de las substancias. @es
definition: Studio della composizione e del modo di reagire fra loro delle varie sostanze
definition: Estudo da composição e da reação das substâncias. @pt-pt
note: nessuno
in scheme: subjectcode
created: 2003-04-05T12:00:00+00:00
modified: 2012-07-10T12:00:00+00:00
broader: http://cv.iptc.org/newscodes/subjectcode/13001000