física de partículas
type: Concept
preferred label: partículas físicas @es
preferred label: Teilchenphysik @de
preferred label: 粒子物理学 @ja-jp
preferred label: particle physics @en-gb
preferred label: Fisica Particelle @it
preferred label: Physique des particules @fr
definition: 高エネルギー粒子を使った素粒子と原子核に関する研究 @ja-jp
definition: Estudo das partículas elementares e dos núcleos atômicos através do emprego de partículas de alta energia.
definition: Estudo das partículas elementares e dos núcleos atómicos através do emprego de partículas de alta energia.
definition: Etude des particules élémentaires et des noyaux des atomes par l'utilisation de particules de haute énergie @fr
definition: The study of elementary particles and atomic nuclei through the use of high-energy particles @en-gb
definition: Wissenschaft der Elementarteilchen, Atomkerne durch den Gebrauch von energiereichen Teilchen. @de
definition: El estudio de partículas elementales y de núcleos atómicos con el uso de partículas de gran energía @es
definition: Studio delle particelle elementari e atomiche @it
note: nessuno @it
in scheme: subjectcode
created: 2004-10-13T12:00:00+00:00
modified: 2012-07-10T12:00:00+00:00
broader: http://cv.iptc.org/newscodes/subjectcode/13001000