Scienze umane
type: Concept
preferred label: ciencias humanas @es
preferred label: Geisteswissenschaft @de
preferred label: human science @en-gb
preferred label: Sciences humaines @fr
preferred label: 人文科学 @ja-jp
definition: Ensemble constitué par la sociologie, la psychologie, l'anthropologie, l'histoire et la science politique @fr
definition: Scienze quali sociologia, psicologia, antropologia, scienze politiche ecc.
definition: Sociology, psychology, anthropology and political science @en-gb
definition: Soziologie, Psychologie, Anthropologie und politische Wissenschaften. @de
definition: Artículos relacionados con sociología, psicología, antropología y ciencias políticas. @es
definition: 社会学、心理学、人類学と政治学関連の記事 @ja-jp
note: nessuno
in scheme: subjectcode
created: 2000-10-30T12:00:00+00:00
modified: 2010-12-15T17:01:09+00:00
broader: http://cv.iptc.org/newscodes/subjectcode/13000000
narrower: http://cv.iptc.org/newscodes/subjectcode/13003001
narrower: http://cv.iptc.org/newscodes/subjectcode/13003002
narrower: http://cv.iptc.org/newscodes/subjectcode/13003003
narrower: http://cv.iptc.org/newscodes/subjectcode/13003004
narrower: http://cv.iptc.org/newscodes/subjectcode/13003005