Paleontologia
type: Concept
preferred label: 古生物学 @ja-jp
preferred label: Paläontologie @de
preferred label: paleontologia @pt-br
preferred label: Paléontologie @fr
preferred label: paleontología @es
preferred label: paleontology @en-gb
definition: The study of ancient animals @en-gb
definition: Estudio de antiguos animales @es
definition: Estudo de animais antigos. @pt-br
definition: Studium ausgestorbener Tiere. @de
definition: Studio degli animali preistorici e degli esseri viventi del passato
definition: L'étude des êtres vivants du passé @fr
definition: 古代動物に関する学問 @ja-jp
note: nessuno
in scheme: subjectcode
created: 2003-04-05T12:00:00+00:00
modified: 2012-07-10T12:00:00+00:00
broader: http://cv.iptc.org/newscodes/subjectcode/13004000