Fisiologia
type: Concept
preferred label: Physiologie @fr
preferred label: 生理学 @ja-jp
preferred label: fisiologia @pt-br
preferred label: Biologie @de
preferred label: physiology @en-gb
preferred label: fisiología @es
definition: The study of vital processes of living organisms @en-gb
definition: Estudio del proceso vital de los organismos vivientes. @es
definition: Estudo dos processos vitais dos organismos vivos. @pt-br
definition: 活動している生体の生命過程に関する学問 @ja-jp
definition: Studio dei processi vitali degli organismi viventi
definition: L'étude des phénomènes vitaux et des mécanismes qui règlent le fonctionnement des êtres vivants @fr
definition: Studium von lebenden Organismen. @de
note: nessuno
in scheme: subjectcode
created: 2003-04-05T12:00:00+00:00
modified: 2012-07-10T12:00:00+00:00
broader: http://cv.iptc.org/newscodes/subjectcode/13004000