Biologia
type: Concept
preferred label: biologia @pt-br
preferred label: Biologie @fr
preferred label: 生物学 @ja-jp
preferred label: biology @en-gb
preferred label: biología @es
definition: 生命がある有機体に関する研究 @ja-jp
definition: Studio degli organismi viventi
definition: Estudo dos organismos vivos. @pt-pt
definition: Etude des organismes vivants @fr
definition: EL estudio de los organizmos vivientes. @es
definition: The study of living organisms @en-gb
definition: Studium der lebenden Organismen. @de
note: nessuno
in scheme: subjectcode
created: 2004-10-13T12:00:00+00:00
modified: 2012-07-10T12:00:00+00:00
broader: http://cv.iptc.org/newscodes/subjectcode/13004000