tecnologia (geral)
type: Concept
preferred label: technology (general) @en-gb
preferred label: 技術（一般） @ja-jp
preferred label: Technologie @fr
preferred label: tecnología (general) @es
preferred label: Tecnologia (generico) @it
preferred label: Technik/Technologie @de
definition: El estudio de lasprácticas o artes industriales, aplicadas a las ciencias tales como física, hidronámicas y termohidrámicas. @es
definition: L'étude des techniques industrielles et des sciences appliquées comme la thermodynamique @fr
definition: 実用的もしくは工芸、物理学、流体力学、熱力学のような応用化学の知識 @ja-jp
definition: Estudo das artes práticas ou industriais e das ciências aplicadas, como física, hidrodinâmica, termodinâmica.
definition: Studium von praktischen und industriellen Fertigkeiten und benachbarte Wissenschaften wie Physik, Hydrodynamik und Thermodynamik. @de
definition: Studio delle tecniche industriali e delle scienze applicate @it
definition: Estudo das artes práticas ou industriais e de ciências aplicadas como física, hidrodinâmica, termodinâmica.
definition: The study of the practical or industrial arts, and applied sciences such as physics, hydrodynamics and thermodynamics @en-gb
note: nessuno @it
in scheme: subjectcode
created: 2000-10-30T12:00:00+00:00
modified: 2010-12-15T17:01:09+00:00
broader: http://cv.iptc.org/newscodes/subjectcode/13000000
narrower: http://cv.iptc.org/newscodes/subjectcode/13010001
narrower: http://cv.iptc.org/newscodes/subjectcode/13010002
broad match: http://cv.iptc.org/newscodes/mediatopic/20000756