normas (standards)
type: Concept
preferred label: Standards @de
preferred label: normas @es
preferred label: standards @en-gb
preferred label: 標準規格 @ja-jp
definition: Normes nationales où internationales de fabrication @fr
definition: Nationale und internationale Regeln, die die Wissenschaft und Technologie steuern. Diese könnten international gesetzte Standards für die Ausrüstung betreffen und Standards zur Einmischung. @de
definition: 科学と技術を管理する国内または国際的なルール。これらは装置や特許権争いの基準のために設定する国際的基準を含むこともある @ja-jp
definition: The rules, national and international, that govern science and technology. These might include international standards setting for equipment and interference standards. @en-gb
definition: Normas, nacionais ou internacionais, que regulam a ciência e a tecnologia. Podem incluir a fixação de padrões internacionais para equipamento ou padrões de interferência.
definition: Normas, nacionais ou internacionais, que regulam a ciência e a tecnologia. Podem incluir a fixação de padrões internacionais para equipamento ou para padrões de interferência.
definition: Las reglamentaciones nacionales e internacionales que rigen la ciencia y la tecnología. Podría incluirse la fijación de normas internacionales con respecto a equipos y normas de interferencia. @es
definition: Norme di fabbricazione nazionali o internazionali @it
note: nessuno @it
in scheme: subjectcode
created: 2000-10-30T12:00:00+00:00
modified: 2010-12-15T17:01:09+00:00
broader: http://cv.iptc.org/newscodes/subjectcode/13000000