ciências marinhas
type: Concept
preferred label: Meeresforschung @de
preferred label: Océanographie @fr
preferred label: 海洋科学 @ja-jp
preferred label: marine science @en-gb
preferred label: ciencias marinas @es
preferred label: Oceanografia @it
definition: 世界の水路および海洋を含む複合的研究分野。これによって、氷の流れのスペクトル観察、漁場研究、水中研究に関連性をもたせることができた @ja-jp
definition: Las áreas multidisciplinarias de investigación que involucran las vías navegables y océanos del mundo. Ello podría incluir la detección hiper-espectral de flujos de hielo, estudios de pesqueras e investigación submarina. @es
definition: Áreas multidisciplinares de investigação que envolvem vias navegáveis e oceanos. Pode incluir a deteção hiperespectral de correntes de gelo, estudos de pesca e investigação submarina.
definition: Áreas multidisciplinares de investigação que envolvem vias navegáveis e oceanos. Pode incluir a detecção hiperespectral de correntes de gelo, estudos de pesca e investigação submarina.
definition: La recherche multidisciplinaire sur les voies navigables et les océans y compris la pêche, la recherche sous-marine, et les mouvements de la glace @fr
definition: The multi-disciplinary research areas involving the worlds' waterways and oceans. This could include hyper-spectral sensing of ice flows, fisheries studies and underwater research. @en-gb
definition: Die weltweiten Wasserstraßen und Ozeane umfassenden interdisziplinären Forschungsgebiete. Diese können die hyper-spektralen Verläufe der Eisströme, Fischerei- und Unterwasserforschung beinhalten. @de
definition: Ricerca multidisciplinare sul mare e le vie d'acqua @it
note: nessuno @it
in scheme: subjectcode
created: 2000-10-30T12:00:00+00:00
modified: 2010-12-15T17:01:09+00:00
broader: http://cv.iptc.org/newscodes/subjectcode/13000000