Climatologia, Meteorologia
type: Concept
preferred label: 気象学 @ja-jp
preferred label: ciências meteorológicas @pt-pt
preferred label: cienciasmeteorológicas @es
preferred label: weather science @en-gb
preferred label: Klimaforschung @de
preferred label: Climatologie @fr
definition: Todos os aspetos científicos sobre clima. @pt-pt
definition: All scientific aspects of the weather and climate. @en-gb
definition: Alle wissenschaftlichen Aspekte bezüglich des Wetters und Klimas. @de
definition: Todos os aspectos científicos do tempo e do clima. @pt-br
definition: Todos los aspectos científicos del los fenómenos meteorológicos y el clima. @es
definition: 天気と気候に関する科学的側面のすべて @ja-jp
definition: La science du climat et les aspects scientifiques de la météo @fr
definition: Tutti gli aspetti scientifici riguardanti lo studio delle condizioni atmosferiche e climatiche
note: nessuno
in scheme: subjectcode
created: 2000-10-30T12:00:00+00:00
modified: 2010-12-15T17:01:09+00:00
broader: http://cv.iptc.org/newscodes/subjectcode/13000000