Matematica
type: Concept
preferred label: matemática @pt-br
preferred label: 数学 @ja-jp
preferred label: Mathematik @de
preferred label: mathematics @en-gb
preferred label: Mathématiques @fr
definition: Insieme delle operazioni logiche applicate al concetto di numero forma e insieme
definition: Estudo das quantidades, formas e suas relações simbólicas. @pt-br
definition: The study of quantities and shapes and their symbolic relationships. @en-gb
definition: Ciência que estuda as quantidades, formas e suas relações simbólicas. @pt-pt
definition: Wissenschaft der Mengen und Formen und ihrer symbolischen Beziehung. @de
definition: Ensemble des opérations logiques que l'homme applique aux concepts de nombre, de forme et d'ensemble @fr
definition: 数量と形、そしてそれらを象徴的に結びつける学問 @ja-jp
definition: El estudio de cantidades y formas y sus relaciones simbólicas. @es
note: nessuno
in scheme: subjectcode
created: 2000-10-30T12:00:00+00:00
modified: 2010-12-15T17:01:09+00:00
broader: http://cv.iptc.org/newscodes/subjectcode/13000000