investigação e tecnologia agrícola
type: Concept
preferred label: investigación y tecnología agrícola @es
preferred label: agricultural research and technology @en-gb
preferred label: Agrarwissenschaft @de
preferred label: Agronomie @fr
preferred label: Ricerca, Tecnologia agricola @it
preferred label: 農業技術 @ja-jp
definition: O que diz respeito ao cultivo de colheitas e à gestão de animais de criação.
definition: Metodica applicata alla crescita dei raccolti e alla gestione degli animali da fattoria @it
definition: Esta relacionado con el crecimiento el cultivo, cosecha y hacerse cargo de una granja de animales. @es
definition: 農作物栽培と酪農経営のこと @ja-jp
definition: Pertaining to the growing of crops and management of farm animals @en-gb
definition: O que diz respeito ao cultivo de colheitas e à gestão de animais de quinta.
definition: Ce qui se rapporte à la croissance des récoltes et à la gestion des animaux fermiers @fr
definition: Betrifft Ackerbau und Viehzucht. @de
note: nessuno @it
in scheme: subjectcode
created: 2003-04-05T12:00:00+00:00
modified: 2012-07-10T12:00:00+00:00
broader: http://cv.iptc.org/newscodes/subjectcode/13000000