Nanotecnologia
type: Concept
preferred label: ナノテク @ja-jp
preferred label: nanotecnología @es
preferred label: nanotecnologia @pt-pt
preferred label: nanotechnology @en-gb
preferred label: Nanotechnologie @fr
definition: 分子尺度で物体を操作すること @ja-jp
definition: Manipular objetos a escala molecular. @es
definition: Manipulation von Objekten auf der molekularen Stufe. @de
definition: Les techniques à l'échelle moléculaire @fr
definition: Manipulação de objetos à escala molecular. @pt-br
definition: Tecnologia e tecniche applicate su scala molecolare
definition: Manipulating objects at the molecular scale @en-gb
note: nessuno
in scheme: subjectcode
created: 2003-04-05T12:00:00+00:00
modified: 2012-07-10T12:00:00+00:00
broader: http://cv.iptc.org/newscodes/subjectcode/13000000