Istituzioni scientifiche
type: Concept
preferred label: Wissenschaftliche Institution @de
preferred label: instituições científicas @pt-pt
preferred label: Institutions scientifiques @fr
preferred label: 科学研究機関 @ja-jp
preferred label: scientific institutions @en-gb
preferred label: instituciones científicas @es
definition: Instituciones que desarrollan o comandan trabajos científicos. @es
definition: Instituições que realizam ou gerem o trabalho científico (e.g. Academia das Ciências). @pt-br
definition: Institutions that carry out or govern scientific work (e.g. National Academy of Arts and Sciences ) @en-gb
definition: Institutionen, die wissenschaftliches Arbeiten verwirklichen oder leiten, wie z.B die Deutsche Akademie der Wissenschaft. @de
definition: 科学に関する仕事を実行、管理する公共機関(例えば、文化系と理科系の国家のアカデミー) @ja-jp
definition: Enti che realizzano o coordinano la ricerca ed il lavoro scientifico
definition: Les institutions telles que l'Académie des Sciences @fr
definition: Instituições que realizam ou gerem trabalho científico (e.g. Academia das Ciências). @pt-pt
note: nessuno
in scheme: subjectcode
created: 2003-11-26T12:00:00+00:00
modified: 2012-07-10T12:00:00+00:00
broader: http://cv.iptc.org/newscodes/subjectcode/13000000