adição
type: Concept
preferred label: Sucht @de
preferred label: dependência
preferred label: 依存症 @ja-jp
preferred label: Toxicomanie @fr
preferred label: Dipendenze @it
preferred label: adicciones @es
preferred label: addiction @en-gb
definition: The habitual and often uncontrollable use of harmful substances such as alcohol, tobacco and pharmaceuticals or drugs @en-gb
definition: Consumo habitual e normalmente incontrolável de substâncias nocivas, como álcool, tabaco, medicamentos ou drogas.
definition: Gewohnheitsmäßiges und meist unkontrolliertes Konsumieren von gefährlichen Stoffen, wie Alkohol, Tabak, Medikamente oder Drogen. @de
definition: Abituale e spesso incontrollabile consumo di sostanze quali alcol, tabacco, droghe @it
definition: アルコールやたばこや製薬品やドラッグなどの有害物質の常習的でコントロールできない摂取 @ja-jp
definition: El uso habitual y normalmente incontrolable de sustancias dañinas tales como el alcoól, tabaco fármacos o drogas. @es
definition: L'utilisation de plus en plus répétitive et souvent incontrollable de substances nocives telles que l'alcool, le tabac, les médicaments ou les drogues @fr
note: nessuno @it
in scheme: subjectcode
created: 2000-10-30T12:00:00+00:00
modified: 2010-12-15T17:01:09+00:00
broader: http://cv.iptc.org/newscodes/subjectcode/14000000