Emigrazione
type: Concept
preferred label: emigrantes @es
preferred label: Emigrés @fr
preferred label: Auswanderer @de
preferred label: 移民 @ja-jp
preferred label: emigrants @en-gb
definition: Fenomeno interessante le persone che hanno lasciato il loro paese d'origine e il loro rapporto con esso, le associazioni di emigrati all'estero
definition: Ensemble des personnes qui ont quitté leur pays d'origine pour aller s'établir dans un autre @fr
definition: Menschen, die ihr Heimatland verlassen, alle Beziehung zu ihrem Heimatland abbrechen und deren Verbindungen mit anderen Emigranten. @de
definition: *Pessoas que deixam seu país de origem; sua relação com seu país de origem e associação com outros emigrantes.* @pt-br
definition: 出生国を離れた人々。出生国との関係、移民同士の親交 @ja-jp
definition: *Pessoas que deixam o seu país de origem; a sua relação com o seu país de origem e associação com outros emigrantes.* @pt-pt
definition: People who leave their country of origin, their relationship with their country of origin and their association with fellow emigrants @en-gb
definition: Gente que deja sus países de origen , su relación con su país de origen y sus asociaciones con sus conciudadanos. @es
note: nessuno
in scheme: subjectcode
created: 2003-11-26T12:00:00+00:00
modified: 2012-07-10T12:00:00+00:00
broader: http://cv.iptc.org/newscodes/subjectcode/14003000