Disabilità
type: Concept
preferred label: 障害者 @ja-jp
preferred label: deficientes @pt-pt
preferred label: Behinderte @de
preferred label: disabled @en-gb
preferred label: Handicapés @fr
preferred label: discapacitados @es
definition: Estar incapacitado física, emocional ou mentalmente. @pt-pt
definition: Being incapacitated either physically, emotionally or mentally @en-gb
definition: Estar descapacitado, ya sea fisica, emocional o mentalmente. @es
definition: Sowohl körperlich, als auch psychisch oder geistig eingeschränkt sein. @de
definition: Etat d'incapacité physique, émotionnelle ou mentale @fr
definition: 身体的、感情的、精神的のいずれかに障害がある人 @ja-jp
definition: Stato di incapacità fisica, emotiva o mentale; Handicap
note: nessuno
in scheme: subjectcode
created: 2000-10-30T12:00:00+00:00
modified: 2010-12-15T17:01:09+00:00
broader: http://cv.iptc.org/newscodes/subjectcode/14000000