Eutanasia, Suicidio assistito
type: Concept
preferred label: euthanasia (also includes assisted suicide) @en-gb
preferred label: eutanasia @es
preferred label: Euthanasie @fr
preferred label: suicídio assistido e eutanásia @pt-br
preferred label: 安楽死 @ja-jp
preferred label: Euthanasie/Sterbehilfe @de
definition: Morte voluntária de uma pessoa com ajuda de outra(s). @pt-br
definition: Freiwilliger Tod durch fremde Hilfe. @de
definition: Muerte voluntaria de una persona con la ayuda de otra. @es
definition: 別人の助けをかりた自発的な死 @ja-jp
definition: Morte volontaria con l'aiuto di un'altra persona
definition: Voluntary death with the aid of another @en-gb
definition: Mort volontaire provoquée dans le but d'abréger les souffrances d'un malade incurable @fr
note: nessuno
in scheme: subjectcode
created: 2000-10-30T12:00:00+00:00
modified: 2010-12-15T17:01:09+00:00
broader: http://cv.iptc.org/newscodes/subjectcode/14000000
narrower: http://cv.iptc.org/newscodes/subjectcode/14005001