Genitori, Figli
type: Concept
preferred label: 親子 @ja-jp
preferred label: padres e hijos @es
preferred label: parent and child @en-gb
preferred label: Relation parent-enfant @fr
preferred label: Eltern-Kind-Beziehung @de
preferred label: pais e filhos @pt-br
definition: Rapporto fra genitori e figli all'interno o meno della famiglia
definition: Dois ou mais indivíduos com uma relação familiar muito próxima. @pt-pt
definition: Two or more individuals with a hierarchical familial relationship @en-gb
definition: Zwei oder mehrere Personen in einer hierarchischen familären Beziehung. @de
definition: Dos o mas individuos con una relación familiar jerárquica. @es
definition: 階層的な家族の関係を持っている2人またはそれ以上の個人 @ja-jp
definition: Dois ou mais indivíduos com uma relação familiar hierárquica. @pt-br
definition: Deux personnes ou plus ayant un lien de parenté direct @fr
note: nessuno
in scheme: subjectcode
created: 2003-04-05T12:00:00+00:00
modified: 2012-07-10T12:00:00+00:00
broader: http://cv.iptc.org/newscodes/subjectcode/14006000