Matrimonio
type: Concept
preferred label: matrimonio @es
preferred label: matrimônio @pt-br
preferred label: matrimónio @pt-pt
preferred label: Heirat @de
preferred label: 結婚 @ja-jp
preferred label: marriage @en-gb
preferred label: Mariage @fr
definition: Unión de dos individuos que juran lealtad, respeto y apoyo mutuo. @es
definition: Die Verbindung von zwei Individuen, die sich gegenseitig Treue, Unterstützung und Respekt schwören. @de
definition: The union of two individuals who pledge fidelity, respect and support for each other @en-gb
definition: União de duas pessoas que juram fidelidade, respeito e apoio mútuos. @pt-br
definition: 貞節、敬意と、お互いに対する支援を誓う2人の個人の結合 @ja-jp
definition: Unione di due individui che si promettono fedeltà , rispetto e aiuto reciproco
definition: Union légitime entre deux personnes qui se jurent fidélité, respect et assistance l'un à l'autre @fr
note: nessuno
in scheme: subjectcode
created: 2003-04-05T12:00:00+00:00
modified: 2012-07-10T12:00:00+00:00
broader: http://cv.iptc.org/newscodes/subjectcode/14006000