Sesso
type: Concept
preferred label: sexo @es
preferred label: Sexualité @fr
preferred label: Geschlecht/Sexualität @de
preferred label: 性 @ja-jp
preferred label: sex @en-gb
definition: Classificação de indivíduos em machos e fêmeas. Ou relações conjugais entre duas pessoas. @pt-pt
definition: 個人が男性であるか女性であるかの分類。あるいは、2人の個人間における婚姻上の関係 @ja-jp
definition: Relazioni sessuali fra individui consenzienti; i costumi sessuali, ecc.
definition: The classification of individuals as either male or female. Or conjugal relationship between two individuals. @en-gb
definition: Die Einteilung von Individuen in weiblich und männlich oder die eheliche Beziehung zwischen beiden. @de
definition: La différenciation des individus en mâles ou femelles. Les relations sexuelles entre deux personnes @fr
definition: Clasificación de individuos como hombre y mujer. Relación conyugal entre dos individuos. @es
note: nessuno
in scheme: subjectcode
created: 2003-04-05T12:00:00+00:00
modified: 2012-07-10T12:00:00+00:00
broader: http://cv.iptc.org/newscodes/subjectcode/14006000